{"text_format":"1","workbook":"xlsx","n_sheets":8,"sheets":["Prijavni obrazec za šolo","programi","vlagatelji","banke","furs","copyrowentry","report","izpis"],"not_rendered":{"charts":0,"images":4,"macros":1,"external_links":0,"defined_names":3,"comments":0,"pivot_tables":0},"unopened":[],"bounds":{"document_bytes":16777216,"sheet_cells":100000,"rows_first":2000,"rows_last":500,"rows_between":2000,"halvings":0,"cell_chars":16384,"cell_head_chars":4096},"cells_cut":0,"cells_raw":0,"read":"whole","date_system":"1900"}

{"sheet":"Prijavni obrazec za šolo","index":0,"n_rows":124,"n_cols":53,"rows_kept":124,"cut":false,"hidden":false,"merged":[[38,7,38,9],[38,10,39,10],[38,11,39,11],[41,1,42,1],[41,2,42,2],[38,6,39,6],[29,1,29,5],[24,1,24,5],[10,2,10,3],[11,0,11,1],[12,0,12,1],[41,0,42,0],[17,0,17,5],[6,0,6,5],[7,0,7,5],[38,0,39,0],[38,2,39,2],[38,3,39,3],[38,4,39,4],[38,5,39,5],[8,0,8,5],[13,0,13,3],[14,0,14,3],[19,0,19,3],[20,0,20,3],[21,0,21,1],[22,0,22,1],[9,2,9,3],[124,9,124,12],[38,1,39,1],[15,1,15,2],[16,1,16,2],[15,4,15,5],[16,4,16,5],[27,1,27,3],[28,1,28,3],[25,1,25,2],[25,4,25,5],[37,0,37,5],[63,4,63,5],[62,4,62,5],[64,4,64,5],[66,0,66,5],[61,0,61,1],[62,0,62,1],[63,0,63,1],[64,0,64,1],[62,2,63,3],[69,0,69,5],[46,0,46,5],[32,0,32,5],[33,0,33,5],[34,0,34,5],[35,0,35,5],[48,1,48,5],[49,1,49,5],[50,1,50,5],[51,1,51,5],[52,1,52,5],[53,1,53,5],[54,1,54,5],[55,1,55,5],[56,1,56,5],[61,4,61,5],[3,0,3,5],[0,0,0,5],[1,0,1,5],[2,0,2,5],[5,0,5,5],[83,0,83,1],[83,2,84,3],[83,4,83,5],[84,0,84,1],[84,4,84,5],[3,7,3,15],[123,3,126,4],[104,0,104,5],[110,1,116,3],[120,1,120,2],[119,1,119,2],[118,1,118,2],[85,0,85,1],[85,4,85,5],[98,0,98,5],[100,0,100,5],[102,0,102,5],[70,1,70,5],[71,1,71,5],[82,0,82,1],[82,4,82,5]]}
["SKLOP B",null,null,null,null,null,null,{"$f":"IF(L15=\"\",\"\",\"Spodaj so z rdečo izpisani opisi morebitnih napak pri vnosu podatkov o vlagatelju: \")","v":""},null,null,null,null,null,null,null,null,null,null,null,null,{"$f":"ROW(A40)","v":40},1,"N","O","D","E",null,null,"P","G","H","I","J","K","AI","AJ","AK",null,null,null,null,"AP","AQ","AR"]
["3.1 PRIJAVNI OBRAZEC ZA ŠOLO",null,null,null,null,null,null,null,null,null,null,null,null,null,null,null,null,null,null,null,null,{"$f":"U1+1","v":41},{"$f":"W$1&$V2","v":"N41"},{"$f":"X$1&$V2","v":"O41"},"D41","E41",null,null,{"$f":"AC$1&$V2","v":"P41"},"G41","H41","I41","J41","K41","AI41","AJ41","AK41",null,null,null,null,{"$f":"AP$1&$V2","v":"AP41"},"AQ41","AR41"]
["JR PUD 2019/2020",null,null,null,null,null,null,null,null,null,null,null,null,null,null,null,null,null,null,null,null,{"$f":"U1+V1","v":41},{"$f":"W$1&$V3","v":"N41"},"O41","D41","E41",null,null,"P41","G41","H41","I41","J41","K41","AI41","AJ41","AK41",null,null,null,null,"AP41","AQ41","AR41"]
["Podatki o šoli",null,null,null,null,null,null,"Za pravilen izpis tega obrazca uporabite ukaz \"Natisni\" na koncu obrazca. \nOblika obrazca v tem delovnem listu je samo uporabniški vmesnik in ni namenjena za tisk.  "]
[]
[null,null,null,null,null,null,null,{"$f":"IF(TRIM(CLEAN(A6))=\"\",\"Vlagatelja izberite s spustnega seznama. \",\"\")","v":"Vlagatelja izberite s spustnega seznama. "}]
["Uradni naziv vlagatelja (šole ali šolskega centra)",null,null,null,null,null,"naziv",{"$f":"IF(AND(H6=\"\",COUNTIF(vlagatelji!A:A,A6)=0),\"Napačen naziv vlagatelja ali neupravičen vlagatelj. Vpisati je potrebno uradni polni naziv vlagatelja. \",\"\")","v":""}]
[]
["Ulica in hišna številka"]
[]
["Poštna številka",null,"Kraj",null,null,null,"dolžina matične",{"$f":"IF(AND(LEN(TRIM(CLEAN(A12)))>0,ISNUMBER(A12),OR(LEN(H15)<7,LEN(H15)>10)),\"Napačna dolžina matične številke vlagatelja. \",\"\")","v":""}]
[null,null,null,null,null,null,"napačna matična",{"$f":"IF(AND(A12<>\"\",H11=\"\",COUNTIF(vlagatelji!B:B,LEFT(H15,7))=0),\"Napačna matična številka vlagatelja ali neupravičen vlagatelj. \",\"\")","v":""}]
["Matična številka",null,null,"(SI) ","ID za DDV ali davčna številka",null,"napačna davčna",{"$f":"IF(AND(E12<>\"\",H14=\"\",COUNTIF(vlagatelji!C:C,J15)=0),\"Napačna davčna številka vlagatelja ali neupravičen vlagatelj. \",\"\")","v":""}]
[null,null,null,null,null,null,"dolžina davčne",{"$f":"IF(AND(LEN(TRIM(CLEAN(E12)))>0,J15<>0,LEN(J15)<>8),\"Napačna dolžina davčne številke vlagatelja. \",\"\")","v":""}]
["Ime in priimek zakonitega zastopnika",null,null,null,null,null,{"$f":"SUBSTITUTE(SUBSTITUTE(SUBSTITUTE(A12,\"-\",\"\"),\"–\",\"\"),\" \",\"\")","v":""},{"$f":"IF(ISNUMBER(VALUE(G15)),G15,0)","v":0},{"$f":"SUBSTITUTE(SUBSTITUTE(SUBSTITUTE(E12,\"-\",\"\"),\"–\",\"\"),\" \",\"\")","v":""},{"$f":"IF(ISNUMBER(VALUE(I15)),I15,0)","v":0},{"$f":"IF(AND(A12<>\"\",E12<>\"\",H11=\"\",H12=\"\",H14=\"\",COUNTIF(vlagatelji!C:C,E12)>0),VLOOKUP(A12,vlagatelji!B:C,2,0)-0,0)","v":0},{"$f":"H7&H11&H12&H13&H14&H16&H17&H18&H30","v":""}]
["SI 56",null,null,null,null,null,"napačen trr",{"$f":"IF(AND(TRIM(CLEAN(B16))<>\"\",H17=\"\",H18=\"\",98-(TRUNC(H19/100)*100-INT(TRUNC(H19/100)*100/97)*97)-RIGHT(H19,2)>0),\"Napačna številka TRR vlagatelja. \",\"\")","v":""}]
[null,"Številka TRR",null,null,"Banka vlagatelja oz. Uprava RS za javna plačila",null,"dolžina trr",{"$f":"IF(OR(LEN(TRIM(CLEAN(B16)))=0,LEN(G19)=15),\"\",\"Napačna dolžina številke TRR vlagatelja. \")","v":""}]
["Kontaktni podatki",null,null,null,null,null,"nedovoljeni znaki trr",{"$f":"IF(AND(TRIM(CLEAN(B16))<>\"\",H17=\"\",H19=0),\"Številka TRR vlagatelja vsebuje nedovoljene znake. \",\"\")","v":""}]
[null,null,null,null,null,null,{"$f":"SUBSTITUTE(SUBSTITUTE(SUBSTITUTE(SUBSTITUTE(SUBSTITUTE(TRIM(CLEAN(B16)),\"-\",\"\"),\"–\",\"\"),\" \",\"\"),\".\",\"\"),\",\",\"\")","v":""},{"$f":"IF(ISNUMBER(VALUE(G19)),G19,0)","v":0}]
[]
{"$rows_left_out":105}
{"sheet":"programi","index":1,"n_rows":114,"n_cols":3,"rows_kept":114,"cut":false,"hidden":true,"merged":[]}
["Administrator",591367,"SPI"]
["Administrator (gibalno ovirani)",651322,"SPI"]
["Administrator (slepi in slabovidni)",758212,"SPI"]
["Administrator DV",999670,"SPI"]
["Administrator (IS)",896602,"SPI"]
["Administrator SI",999603,"SPI"]
["Avtokaroserist",193977,"SPI"]
["Avtoserviser",609882,"SPI"]
["Avtoserviser (DV)",801402,"SPI"]
["Avtoserviser (IS)",227024,"SPI"]
["Avtoserviser SI",999604,"SPI"]
["Bolničar-negovalec",511147,"SPI"]
["Bolničar-negovalec SI",999680,"SPI"]
["Cvetličar",303436,"SPI"]
["Dimnikar",469994,"SPI"]
["Elektrikar",277536,"SPI"]
["Elektrikar (DV)",217133,"SPI"]
["Elektrikar SI",999605,"SPI"]
["Frizer",363034,"SPI"]
["Frizer SI",999606,"SPI"]
{"$rows_left_out":95}
{"sheet":"vlagatelji","index":2,"n_rows":101,"n_cols":3,"rows_kept":101,"cut":false,"hidden":true,"merged":[]}
["ABITURA Podjetje za izobraževanje, d.o.o., Celje",5685630,18146856]
["ACADEMIA družba za storitve d.o.o.",1195280,"52188353"]
["B & B izobraževanje in usposabljanje d.o.o.",5351600,11425946]
["B2 izobraževalni center, d.o.o.",5321018,98299212]
["BIOTEHNIŠKA ŠOLA MARIBOR",5085454,"42181216"]
["BIOTEHNIŠKA ŠOLA RAKIČAN",5089794,81849494]
["Biotehniški center Naklo",5088739,"66817994"]
["BIOTEHNIŠKI IZOBRAŽEVALNI CENTER LJUBLJANA",5084571,"95277145"]
["CENTER ZA IZOBRAŽEVANJE, REHABILITACIJO IN USPOSABLJANJE KAMNIK",5049768,99621053]
["DOBA EVROPSKO POSLOVNO IZOBRAŽEVALNO SREDIŠČE d.o.o.",5365708,"30873045"]
["DVOJEZIČNA SREDNJA ŠOLA LENDAVA KETNYELVU KOZEPISKOLA LENDVA",5084067,"39462692"]
["EDC - zavod za strokovno izobraževanje, Kranj",5929059,23770287]
["EKONOMSKA IN TRGOVSKA ŠOLA BREŽICE",1458558,"51349728"]
["EKONOMSKA ŠOLA MURSKA SOBOTA",5216214,"20192533"]
["EKONOMSKA ŠOLA NOVO MESTO",5089115,"84477849"]
["EMONA EFEKTA, izobraževanje in svetovanje, d.o.o.",5059054,46380264]
["ERUDIO IZOBRAŽEVALNI CENTER, Zavod za izobraževanje, svetovanje in organizacijo",5742307,19618174]
["GEA COLLEGE CVŠ, Družba za višješolsko izobraževanje - Center višjih šol, d.o.o.",2059126,51621193]
["GIMNAZIJA IN SREDNJA KEMIJSKA ŠOLA RUŠE",5085861,11732199]
["GIMNAZIJA IN SREDNJA ŠOLA KOČEVJE",6214312,"22854509"]
{"$rows_left_out":82}
{"sheet":"banke","index":3,"n_rows":19,"n_cols":2,"rows_kept":19,"cut":false,"hidden":true,"merged":[]}
[5026024000,"ABANKA d.d."]
[1319175000,"ADDIKO BANK d.d."]
[5092221000,"BANKA INTESA SANPAOLO D.D."]
[5023912000,"BANKA SLOVENIJE"]
[2211254000,"BANKA SPARKASSE d.d."]
[2013649000,"BKS Bank AG Bančna podružnica"]
[5448557000,"Delavska hranilnica d.d. Ljubljana"]
[5349907000,"DEŽELNA BANKA SLOVENIJE d.d."]
[5103061000,"GORENJSKA BANKA d.d., KRANJ"]
[5624908000,"Hranilnica LON d.d., Kranj"]
[5860580000,"NOVA KREDITNA BANKA MARIBOR d.d."]
[5860571000,"NOVA LJUBLJANSKA BANKA d.d., LJUBLJANA"]
[5214246000,"Primorska hranilnica Vipava d.d."]
[2253763000,"RCI Banque Societe Anonyme, bančna podružnica Ljubljana"]
[5496527000,"SBERBANK BANKA d.d."]
[5665493000,"SID - SLOVENSKA IZVOZNA IN RAZVOJNA BANKA, d.d., LJUBLJANA"]
[5026237000,"SKB BANKA d.d. LJUBLJANA"]
[5446546000,"UNICREDIT BANKA SLOVENIJA d.d."]
[5023912000,"Uprava RS za javna plačila"]

{"sheet":"furs","index":4,"n_rows":15,"n_cols":67,"rows_kept":15,"cut":false,"hidden":true,"merged":[]}
["Furs"]
["/"]
["SI"]
[]
[]
[]
[]
[]
[]
[]
[]
[]
[]
[]
[1,2,3,4,5,6,7,8,9,10,11,12,13,14,15,16,17,18,19,20,21,22,23,24,25,26,27,28,29,30,31,32,33,34,35,36,37,38,39,40,41,42,43,44,45,46,47,48,49,50,51,52,53,54,55,56,57,58,59,60,61,62,63,64,65,66,67]

{"sheet":"copyrowentry","index":5,"n_rows":6,"n_cols":53,"rows_kept":6,"cut":false,"hidden":true,"merged":[]}
[]
[]
[]
[]
[{"$f":"ROW()-U$1","v":5},null,null,null,null,null,null,null,null,null,null,{"$f":"AP5","v":0},null,{"$f":"TRIM(CLEAN(F5))","v":""},{"$f":"PROPER(TRIM(CLEAN(SUBSTITUTE(SUBSTITUTE(\"x\"&B5&\" \"&C5,\"Ć\",\"Č\"),\"ć\",\"č\"))))","v":"X"},{"$f":"IF(ISNUMBER(VALUE(D5)),SUBSTITUTE(SUBSTITUTE(D5,\".\",\"\"),\",\",\"\"),\"\")","v":""},{"$f":"AZ5&BA5&R5&S5&U5&V5&W5&X5&Y5&Z5&AD5&AE5&AG5&AL5&AS5&AU5&AV5&AW5&AX5&AY5","v":{"$error":"#REF!"}},{"$f":"IF(AND(LEN(D5)>0,D5<>P5),\"EMŠO prijavljene osebe vsebuje znake, ki niso številke: \"&D5&\" \n\",\"\")","v":""},{"$f":"IF(D5=\"\",\"Manjka EMŠO prijavljene osebe. \n\",\"\")","v":"Manjka EMŠO prijavljene osebe. \n"},{"$f":"IF(AND(LEN(D5)=13,R5=\"\"),RIGHT(D5,1)-MOD(11-MOD(LEFT(D5,1)*7+RIGHT(LEFT(D5,2),1)*6+RIGHT(LEFT(D5,3),1)*5+RIGHT(LEFT(D5,4),1)*4+RIGHT(LEFT(D5,5),1)*3+RIGHT(LEFT(D5,6),1)*2+RIGHT(LEFT(D5,7),1)*7+RIGHT(LEFT(D5,8),1)*6+RIGHT(LEFT(D5,9),1)*5+RIGHT(LEFT(D5,10),1)*4+RIGHT(LEFT(D5,11),1)*3+RIGHT(LEFT(D5,12),1)*2,11),11)=0,0)","v":0},{"$f":"IF(AND(R5=\"\",S5=\"\",NOT(T5)),\"Napačen EMŠO prijavljene osebe: \"&D5&\" \n\",\"\")","v":""},{"$f":"IF(AND(D5<>\"\",COUNTIFS(INDIRECT(X$2&\":\"&X$3),\"<>\"&O5,INDIRECT(Y$2&\":\"&Y$3),\"<>\",INDIRECT(Y$2&\":\"&Y$3),D5)>0),\"Za različne prijavljene osebe je vpisan isti EMŠO: \"&D5&\" \n\",\"\")","v":{"$error":"#REF!"}},{"$f":"IF(AND(E5<>\"\",COUNTIFS(INDIRECT(Y$2&\":\"&Y$3),D5,INDIRECT(Z$2&\":\"&Z$3),\"<>\",INDIRECT(Z$2&\":\"&Z$3),\"<>\"&E5)>0),\"Za to prijavljeno osebo sta vpisana različna izobraževalna programa. \n\",\"\")","v":{"$error":"#REF!"}},{"$f":"IF(E5=\"\",\"Manjka izobraževalni program. \n\",\"\")","v":"Manjka izobraževalni program. \n"},{"$f":"IF(AND(E5<>\"\",COUNTIF(programi!A:A,TRIM(CLEAN(E5)))=0),\"Napaka pri vnosu izobraževalnega programa. \n\",\"\")","v":""},{"$f":"IF(AND(D5<>\"\",COUNTIFS(INDIRECT(Y$2&\":\"&Y$3),D5,INDIRECT(AD$2&\":\"&AD$3),G5)>1),\"Ista oseba (EMŠO: \"&TRIM(CLEAN(D5))&\") je več kot enkrat navedena pri istem delodajalcu (\"&TRIM(CLEAN(N5))&\"). \n\",\"\")","v":{"$error":"#REF!"}},null,null,{"$f":"IF(AND(G5<>\"\",ISNUMBER(VALUE(G5))),VALUE(SUBSTITUTE(SUBSTITUTE(G5,\".\",\"\"),\",\",\"\")),\"\")","v":""},{"$f":"IF(AND(G5<>\"\",TEXT(G5,\"#\")<>TEXT(AC5,\"#\")),\"Matična številka delodajalca vsebuje znake, ki niso številke: \"&TRIM(CLEAN(G5))&\"\n\",\"\")","v":""},{"$f":"IF(G5=\"\",\"Manjka matična številka delodajalca. \n\",\"\")","v":"Manjka matična številka delodajalca. \n"},{"$f":"IF(OR(AD5<>\"\",AE5<>\"\",AND(LEFT(G5,3)=\"100\",LEN(G5)=9)),\"\",(RIGHT(LEFT(G5,7),1)-MOD(11-MOD(LEFT(G5,1)*7+RIGHT(LEFT(G5,2),1)*6+RIGHT(LEFT(G5,3),1)*5+RIGHT(LEFT(G5,4),1)*4+RIGHT(LEFT(G5,5),1)*3+RIGHT(LEFT(G5,6),1)*2,11),10)=0)+(RIGHT(LEFT(G5,7),1)-MOD(11-MOD(LEFT(G5,1)*2+RIGHT(LEFT(G5,2),1)*3+RIGHT(LEFT(G5,3),1)*4+RIGHT(LEFT(G5,4),1)*5+RIGHT(LEFT(G5,5),1)*6+RIGHT(LEFT(G5,6),1)*7,11),10)=0)+(AND(LEFT(G5,1)-5=0,RIGHT(LEFT(G5,7),1)-MOD(10-MOD(TRUNC(LEFT(G5,1)/5)+MOD(LEFT(G5,1)*2,10)+RIGHT(LEFT(G5,2),1)+TRUNC(RIGHT(LEFT(G5,3),1)/5)+MOD(RIGHT(LEFT(G5,3),1)*2,10)+RIGHT(LEFT(G5,4),1)+TRUNC(RIGHT(LEFT(G5,5),1)/5)+MOD(RIGHT(LEFT(G5,5),1)*2,10)+RIGHT(LEFT(G5,6),1),10),10)=0))-0)","v":""},{"$f":"IF(AND(AD5=\"\",AE5=\"\",AF5=0),\"Napačna matična številka delodajalca: \"&TRIM(CLEAN(G5))&\"\n\",\"\")","v":""},{"$f":"IF(AND(X5=\"\",Y5=\"\"),VLOOKUP(TRIM(CLEAN(E5)),programi!A:B,2,0),\"\")","v":""},{"$f":"IF(D5=\"\",0,1/COUNTIF(INDIRECT(Y$2&\":\"&Y$3),D5))","v":0},{"$f":"IF(E5=\"\",0,1/COUNTIF(INDIRECT(Z$2&\":\"&Z$3),E5))","v":0},{"$f":"IF(G5=\"\",0,1/COUNTIF(INDIRECT(AD$2&\":\"&AD$3),G5))","v":0},{"$f":"IF(OR(AND(LEN(H5)>0,NOT(ISNUMBER(VALUE(H5)))),AND(LEN(I5)>0,NOT(ISNUMBER(VALUE(I5)))),AND(LEN(J5)>0,NOT(ISNUMBER(VALUE(J5)))),AND(LEN(K5)>0,NOT(ISNUMBER(VALUE(K5))))),\"Podatki o obsegu PUD/PRI vsebujejo znake, ki niso številke. V teh poljih se bo izpisala vrednost 0. \n\",\"\")","v":""},{"$f":"IF(AND(LEN(H5)>0,ISNUMBER(VALUE(H5))),ROUND(VALUE(H5),1),0)","v":0},0,0,{"$f":"AM5+AN5+AO5","v":0},{"$f":"IF(AND(LEN(K5)>0,ISNUMBER(VALUE(K5))),ROUND(VALUE(K5),0),0)","v":0},{"$f":"IF(AND(X5=\"\",Y5=\"\"),VLOOKUP(TRIM(CLEAN(E5)),programi!A:C,3,0),\"\")","v":""},{"$f":"IF(AQ5=0,\"Manjka podatek \"\"Skupaj predpisano število tednov po programu v vseh letnikih\"\". \n\",\"\")","v":"Manjka podatek \"Skupaj predpisano število tednov po programu v vseh letnikih\". \n"},{"$f":"IF(AND(AS5=\"\",COUNTIFS(INDIRECT(Z$2&\":\"&Z$3),E5,INDIRECT(AQ$2&\":\"&AQ$3),\">0\",INDIRECT(AQ$2&\":\"&AQ$3),\"<>\"&AQ5)>0),\"Za isti izobraževalni program (\"&TRIM(CLEAN(E5))&\") so navedene različne predpisane dolžine PUD/PRI. \n\",\"\")","v":{"$error":"#REF!"}},{"$f":"IF(AND(S5=\"\",AE5=\"\",AS5=\"\",AR5=\"SPI\",SUMIFS(INDIRECT(AP$2&\":\"&AP$3),INDIRECT(Y$2&\":\"&Y$3),D5,INDIRECT(AD$2&\":\"&AD$3),G5,INDIRECT(Z$2&\":\"&Z$3),E5,INDIRECT(AR$2&\":\"&AR$3),\"SPI\")<3),\"Skupna dolžina PUD za to osebo pri delodajalcu \"&TRIM(CLEAN(N5))&\" je krajša od 3 tednov. \n\",\"\")","v":{"$error":"#REF!"}},{"$f":"IF(AND(S5=\"\",AE5=\"\",AS5=\"\",AR5=\"VSŠ\",SUMIFS(INDIRECT(AP$2&\":\"&AP$3),INDIRECT(Y$2&\":\"&Y$3),D5,INDIRECT(AD$2&\":\"&AD$3),G5,INDIRECT(Z$2&\":\"&Z$3),E5,INDIRECT(AR$2&\":\"&AR$3),\"VSŠ\")<8),\"Skupna dolžina PRI za to osebo pri delodajalcu \"&TRIM(CLEAN(N5))&\" je krajša od 8 tednov. \n\",\"\")","v":{"$error":"#REF!"}},{"$f":"IF(AND(AR5=\"SPI\",AS5=\"\",AQ5<24),\"Skupaj predpisana dolžina PUD po vseh letnikih je krajša od 24 tednov. \n\",\"\")","v":""},{"$f":"IF(AND(AR5=\"VSŠ\",AS5=\"\",AQ5<20),\"Skupaj predpisana dolžina PRI po vseh letnikih je krajša od 20 tednov. \n\",\"\")","v":""},{"$f":"IF(AND(S5=\"\",AS5=\"\",AU5=\"\",AV5=\"\",SUMIFS(INDIRECT(AP$2&\":\"&AP$3),INDIRECT(Y$2&\":\"&Y$3),D5,INDIRECT(Z$2&\":\"&Z$3),E5)>AQ5),\"Dolžina PUD/PRI pri delodajalcih za to osebo presega skupaj predpisano dolžino po programu v vseh letnikih. \n\",\"\")","v":{"$error":"#REF!"}},{"$f":"IF(B5=\"\",\"Manjka ime prijavljene osebe. \n\",\"\")","v":"Manjka ime prijavljene osebe. \n"},{"$f":"IF(C5=\"\",\"Manjka priimek prijavljene osebe. \n\",\"\")","v":"Manjka priimek prijavljene osebe. \n"}]
[null,null,null,null,null,null,null,null,null,null,null,null,null,null,null,null,null,null,null,null,null,null,null,null,null,null,null,null,{"$f":"TEXT(AC5,\"#\")","v":""}]

{"sheet":"report","index":6,"n_rows":15,"n_cols":11,"rows_kept":15,"cut":false,"hidden":true,"merged":[[7,1,7,2],[7,3,7,4],[7,6,7,7],[7,9,7,12],[9,1,9,8],[9,10,9,11],[5,1,5,5],[6,1,6,2],[6,3,6,4],[6,6,6,7],[6,9,6,12],[10,10,10,11],[12,1,12,6],[12,7,13,9],[12,10,13,11],[13,1,13,2],[13,3,13,4],[13,5,13,6],[10,1,10,8],[14,1,14,2],[14,3,14,4],[14,5,14,6],[14,7,14,9],[14,10,14,11]]}
[]
[]
[]
[]
[]
[null,"Podatki o dijaku oz. študentu št. ",null,null,null,null,{"$f":"TRUNC((ROW()-V$37)/12)+1","v":1}]
[]
[null,"Ime dijaka/študenta",null,"Priimek dijaka/študenta",null,null,"EMŠO dijaka/študenta",null,null,"Izobraževalni program"]
[]
[]
[null,"Naziv delodajalca",null,null,null,null,null,null,null,null,"Matična št. delodajalca (oz. KMG-MID)"]
[]
[null," Število tednov PUD/PRI v letniku pri tem delodajalcu po pogodbi",null,null,null,null,null,"Skupaj število tednov \npri tem delodajalcu",null,null,"Skupaj predpisano št. tednov po programu v vseh letnikih"]
[null,"1. letnik",null,"2. letnik",null,"3. letnik"]
[null,{"$f":"ROUND(V15,1)","v":0},null,{"$f":"ROUND(W15,1)","v":0},null,{"$f":"ROUND(X15,1)","v":0},null,{"$f":"ROUND(B15,1)+ROUND(D15,1)+ROUND(F15,1)","v":0},null,null,{"$f":"ROUND(Y15,0)","v":0}]

{"sheet":"izpis","index":7,"n_rows":194,"n_cols":25,"rows_kept":194,"cut":false,"hidden":true,"merged":[[46,1,46,2],[46,3,46,4],[46,5,46,6],[46,7,46,9],[46,10,46,11],[42,1,42,8],[42,10,42,11],[44,1,44,6],[44,7,45,9],[44,10,45,11],[45,1,45,2],[45,3,45,4],[45,5,45,6],[39,1,39,2],[39,3,39,4],[39,6,39,7],[39,9,39,12],[41,1,41,8],[41,10,41,11],[37,1,37,5],[38,1,38,2],[38,3,38,4],[38,6,38,7],[38,9,38,12],[58,1,58,2],[58,3,58,4],[58,5,58,6],[58,7,58,9],[58,10,58,11],[54,1,54,8],[54,10,54,11],[56,1,56,6],[56,7,57,9],[56,10,57,11],[57,1,57,2],[57,3,57,4],[57,5,57,6],[51,1,51,2],[51,3,51,4],[51,6,51,7],[51,9,51,12],[53,1,53,8],[53,10,53,11],[49,1,49,5],[50,1,50,2],[50,3,50,4],[50,6,50,7],[50,9,50,12],[70,1,70,2],[70,3,70,4],[70,5,70,6],[70,7,70,9],[70,10,70,11],[66,1,66,8],[66,10,66,11],[68,1,68,6],[68,7,69,9],[68,10,69,11],[69,1,69,2],[69,3,69,4],[69,5,69,6],[63,1,63,2],[63,3,63,4],[63,6,63,7],[63,9,63,12],[65,1,65,8],[65,10,65,11],[61,1,61,5],[62,1,62,2],[62,3,62,4],[62,6,62,7],[62,9,62,12],[82,1,82,2],[82,3,82,4],[82,5,82,6],[82,7,82,9],[82,10,82,11],[78,1,78,8],[78,10,78,11],[80,1,80,6],[80,7,81,9],[80,10,81,11],[81,1,81,2],[81,3,81,4],[81,5,81,6],[75,1,75,2],[75,3,75,4],[75,6,75,7],[75,9,75,12],[77,1,77,8],[77,10,77,11],[73,1,73,5],[74,1,74,2],[74,3,74,4],[74,6,74,7],[74,9,74,12],[94,1,94,2],[94,3,94,4],[94,5,94,6],[94,7,94,9],[94,10,94,11],[90,1,90,8],[90,10,90,11],[92,1,92,6],[92,7,93,9],[92,10,93,11],[93,1,93,2],[93,3,93,4],[93,5,93,6],[87,1,87,2],[87,3,87,4],[87,6,87,7],[87,9,87,12],[89,1,89,8],[89,10,89,11],[85,1,85,5],[86,1,86,2],[86,3,86,4],[86,6,86,7],[86,9,86,12],[98,3,98,4],[98,6,98,7],[98,9,98,12],[106,1,106,2],[106,3,106,4],[106,5,106,6],[106,7,106,9],[106,10,106,11],[102,1,102,8],[102,10,102,11],[104,1,104,6],[104,7,105,9],[104,10,105,11],[105,1,105,2],[105,3,105,4],[105,5,105,6],[10,4,10,7],[11,6,11,8],[118,3,118,4],[118,5,118,6],[27,1,27,6],[28,1,28,6],[116,1,116,6],[116,7,117,9],[118,7,118,9],[111,9,111,12],[111,6,111,7],[114,1,114,8],[29,1,29,12],[13,0,13,8],[20,10,20,13],[14,0,14,7],[99,1,99,2],[99,3,99,4],[99,6,99,7],[99,9,99,12],[101,1,101,8],[101,10,101,11],[97,1,97,5],[98,1,98,2],[144,0,144,13],[163,0,163,5],[163,8,163,13],[162,0,162,5],[147,0,147,12],[148,1,148,12],[149,1,149,12],[160,8,160,13],[162,8,162,13],[0,0,0,13],[1,0,1,13],[2,0,2,13],[6,0,6,13],[8,0,8,13],[5,0,5,13],[7,0,7,13],[3,0,3,3],[180,2,186,8],[15,7,15,14],[19,0,19,7],[17,0,17,3],[21,0,21,3],[20,0,20,7],[15,0,15,1],[16,0,16,1],[16,2,16,5],[15,2,15,5],[24,1,24,12],[22,0,22,3],[16,7,16,14],[25,2,25,6],[19,10,19,13],[25,8,25,12],[193,7,196,12],[110,3,110,4],[109,1,109,5],[139,8,139,13],[117,1,117,2],[114,10,114,11],[113,10,113,11],[172,0,172,13],[174,0,174,13],[142,8,142,13],[142,0,142,5],[140,8,140,13],[140,6,141,7],[161,8,161,13],[110,6,110,7],[111,1,111,2],[113,1,113,8],[118,10,118,11],[116,10,117,11],[118,1,118,2],[170,0,170,13],[160,0,160,5],[161,0,161,5],[161,6,162,7],[9,0,9,2],[9,4,9,7],[122,0,122,13],[141,8,141,13],[130,1,130,12],[131,1,131,12],[132,1,132,12],[133,1,133,12],[134,1,134,12],[139,0,139,5],[141,0,141,5],[140,0,140,5],[110,1,110,2],[110,9,110,12],[12,0,12,3],[11,0,11,3],[129,1,129,12],[124,0,124,13],[117,3,117,4],[117,5,117,6],[111,3,111,4],[126,1,126,12],[127,1,127,12],[128,1,128,12]]}
[{"$f":"'Prijavni obrazec za šolo'!A1:N1","v":"SKLOP B"},null,null,null,null,null,null,null,null,null,null,null,null,null,null,null,null,null,null,null,{"$f":"ROW(A37)","v":37},7]
[{"$f":"'Prijavni obrazec za šolo'!A2:N2","v":"3.1 PRIJAVNI OBRAZEC ZA ŠOLO"},null,null,null,null,null,null,null,null,null,null,null,null,null,null,null,null,null,null,null,null,{"$f":"U1+1","v":38}]
[{"$f":"'Prijavni obrazec za šolo'!A3:N3","v":"JR PUD 2019/2020"},null,null,null,null,null,null,null,null,null,null,null,null,null,null,null,null,null,null,null,null,{"$f":"U1+12*V1","v":121}]
[{"$f":"'Prijavni obrazec za šolo'!A4:D4","v":"Podatki o šoli"}]
[]
[{"$f":"TRIM(CLEAN('Prijavni obrazec za šolo'!A6))","v":""}]
[{"$f":"'Prijavni obrazec za šolo'!A7","v":"Uradni naziv vlagatelja (šole ali šolskega centra)"}]
[{"$f":"TRIM(CLEAN('Prijavni obrazec za šolo'!A8))","v":""}]
[{"$f":"'Prijavni obrazec za šolo'!A9","v":"Ulica in hišna številka"}]
[{"$f":"TRIM(CLEAN('Prijavni obrazec za šolo'!A10))","v":""},null,null,null,{"$f":"TRIM(CLEAN('Prijavni obrazec za šolo'!C10))","v":""}]
[{"$f":"'Prijavni obrazec za šolo'!A11","v":"Poštna številka"},null,null,null,{"$f":"'Prijavni obrazec za šolo'!E11","v":0}]
[{"$f":"TRIM(CLEAN('Prijavni obrazec za šolo'!A12))","v":""},null,null,null,null,{"$f":"TRIM(CLEAN('Prijavni obrazec za šolo'!D12))","v":""},{"$f":"TRIM(CLEAN('Prijavni obrazec za šolo'!E12))","v":""}]
[{"$f":"'Prijavni obrazec za šolo'!A13","v":"Matična številka"},null,null,null,null,{"$f":"'Prijavni obrazec za šolo'!D13","v":"(SI) "},{"$f":"'Prijavni obrazec za šolo'!E13","v":"ID za DDV ali davčna številka"}]
[{"$f":"TRIM(CLEAN('Prijavni obrazec za šolo'!A14))","v":""}]
[{"$f":"'Prijavni obrazec za šolo'!A15","v":"Ime in priimek zakonitega zastopnika"}]
[{"$f":"'Prijavni obrazec za šolo'!A16","v":"SI 56"},null,{"$f":"TRIM(CLEAN('Prijavni obrazec za šolo'!B16))","v":""},null,null,null,null,{"$f":"TRIM(CLEAN('Prijavni obrazec za šolo'!E16))","v":""}]
[null,null,{"$f":"'Prijavni obrazec za šolo'!B17","v":"Številka TRR"},null,null,null,null,{"$f":"'Prijavni obrazec za šolo'!E17","v":"Banka vlagatelja oz. Uprava RS za javna plačila"}]
[{"$f":"'Prijavni obrazec za šolo'!A18","v":"Kontaktni podatki"}]
[]
[{"$f":"TRIM(CLEAN('Prijavni obrazec za šolo'!A20))","v":""},null,null,null,null,null,null,null,null,null,{"$f":"TRIM(CLEAN('Prijavni obrazec za šolo'!F20))","v":""}]
{"$rows_left_out":174}